{"text_format":"1","workbook":"xlsx","n_sheets":5,"sheets":["pml_leagues","pml_matches","DRAFTS","LEAGUES","MATCHES"],"not_rendered":{"charts":0,"images":0,"macros":1,"external_links":0,"defined_names":2,"comments":0,"pivot_tables":0},"unopened":[],"bounds":{"document_bytes":16777216,"sheet_cells":100000,"rows_first":2000,"rows_last":500,"rows_between":2000,"halvings":0,"cell_chars":16384,"cell_head_chars":4096},"cells_cut":0,"cells_raw":0,"read":"whole","date_system":"1900"}

{"sheet":"pml_leagues","index":0,"n_rows":25,"n_cols":3,"rows_kept":25,"cut":false,"hidden":true,"merged":[]}
[]
[null,null,{"$f":"$A2&\"\"","v":""}]
[null,null,{"$f":"$A3&\"\"","v":""}]
[null,null,""]
[null,null,""]
[null,null,""]
[null,null,""]
[null,null,""]
[null,null,""]
[null,null,""]
[null,null,""]
[null,null,""]
[null,null,""]
[null,null,""]
[null,null,""]
[null,null,""]
[null,null,""]
[null,null,""]
[null,null,""]
[null,null,""]
[null,null,""]
[null,null,""]
[null,null,""]
[null,null,""]
[null,null,""]

{"sheet":"pml_matches","index":1,"n_rows":321,"n_cols":3,"rows_kept":321,"cut":false,"hidden":true,"merged":[]}
[null,null,{"$f":"IFERROR(RIGHT($A1,LEN($A1)-SEARCH(\"]\",$A1)-1),\"\")","v":""}]
[null,null,{"$f":"TRIM(IFERROR(RIGHT($A2,LEN($A2)-SEARCH(\"]\",$A2)-1),$A2&\"\"))","v":""}]
[null,null,{"$f":"TRIM(IFERROR(RIGHT($A3,LEN($A3)-SEARCH(\"]\",$A3)-1),$A3&\"\"))","v":""}]
[null,null,""]
[null,null,""]
[null,null,""]
[null,null,""]
[null,null,""]
[null,null,""]
[null,null,""]
[null,null,""]
[null,null,""]
[null,null,""]
[null,null,""]
[null,null,""]
[null,null,""]
[null,null,""]
[null,null,""]
[null,null,""]
[null,null,""]
[null,null,""]
[null,null,""]
[null,null,""]
[null,null,""]
[null,null,""]
[null,null,""]
[null,null,""]
[null,null,""]
[null,null,""]
[null,null,""]
[null,null,""]
[null,null,""]
[null,null,""]
[null,null,""]
[null,null,""]
[null,null,""]
[null,null,""]
[null,null,""]
[null,null,""]
[null,null,""]
[null,null,""]
[null,null,""]
[null,null,""]
[null,null,""]
[null,null,""]
[null,null,""]
[null,null,""]
[null,null,""]
[null,null,""]
[null,null,""]
[null,null,""]
[null,null,""]
[null,null,""]
[null,null,""]
[null,null,""]
[null,null,""]
[null,null,""]
[null,null,""]
[null,null,""]
[null,null,""]
{"$rows_left_out":262}
{"sheet":"DRAFTS","index":2,"n_rows":352,"n_cols":3,"rows_kept":352,"cut":false,"hidden":false,"merged":[]}
[]
[null,"НОМИНИРАНИ ПОТОЦИ"]
[]
[1,{"$f":"INDEX(pml_leagues!$C$2:$C$25,$A4)","v":""}]
[2,{"$f":"INDEX(pml_leagues!$C$2:$C$25,$A5)","v":""}]
[3,{"$f":"INDEX(pml_leagues!$C$2:$C$25,$A6)","v":""}]
[4,{"$f":"INDEX(pml_leagues!$C$2:$C$25,$A7)","v":""}]
[5,{"$f":"INDEX(pml_leagues!$C$2:$C$25,$A8)","v":""}]
[6,{"$f":"INDEX(pml_leagues!$C$2:$C$25,$A9)","v":""}]
[7,{"$f":"INDEX(pml_leagues!$C$2:$C$25,$A10)","v":""}]
[8,{"$f":"INDEX(pml_leagues!$C$2:$C$25,$A11)","v":""}]
[9,{"$f":"INDEX(pml_leagues!$C$2:$C$25,$A12)","v":""}]
[10,{"$f":"INDEX(pml_leagues!$C$2:$C$25,$A13)","v":""}]
[11,{"$f":"INDEX(pml_leagues!$C$2:$C$25,$A14)","v":""}]
[12,{"$f":"INDEX(pml_leagues!$C$2:$C$25,$A15)","v":""}]
[13,{"$f":"INDEX(pml_leagues!$C$2:$C$25,$A16)","v":""}]
[14,{"$f":"INDEX(pml_leagues!$C$2:$C$25,$A17)","v":""}]
[15,{"$f":"INDEX(pml_leagues!$C$2:$C$25,$A18)","v":""}]
[16,{"$f":"INDEX(pml_leagues!$C$2:$C$25,$A19)","v":""}]
[17,{"$f":"INDEX(pml_leagues!$C$2:$C$25,$A20)","v":""}]
[18,{"$f":"INDEX(pml_leagues!$C$2:$C$25,$A21)","v":""}]
[19,{"$f":"INDEX(pml_leagues!$C$2:$C$25,$A22)","v":""}]
[20,{"$f":"INDEX(pml_leagues!$C$2:$C$25,$A23)","v":""}]
[21,{"$f":"INDEX(pml_leagues!$C$2:$C$25,$A24)","v":""}]
[22,{"$f":"INDEX(pml_leagues!$C$2:$C$25,$A25)","v":""}]
[23,{"$f":"INDEX(pml_leagues!$C$2:$C$25,$A26)","v":""}]
[24,{"$f":"INDEX(pml_leagues!$C$2:$C$25,$A27)","v":""}]
[]
[]
[]
[null,"НОМИНИРАНИ МАЧОВЕ"]
[]
[1,{"$f":"INDEX(pml_matches!$C$2:$C$321,$A33)","v":""},{"$f":"IFERROR(VALUE(LEFT($B33,8)),\"\")","v":""}]
[2,{"$f":"INDEX(pml_matches!$C$2:$C$321,$A34)","v":""},{"$f":"IFERROR(VALUE(LEFT($B34,8)),\"\")","v":""}]
[3,{"$f":"INDEX(pml_matches!$C$2:$C$321,$A35)","v":""},""]
[4,{"$f":"INDEX(pml_matches!$C$2:$C$321,$A36)","v":""},""]
[5,{"$f":"INDEX(pml_matches!$C$2:$C$321,$A37)","v":""},""]
[6,{"$f":"INDEX(pml_matches!$C$2:$C$321,$A38)","v":""},""]
[7,{"$f":"INDEX(pml_matches!$C$2:$C$321,$A39)","v":""},""]
[8,{"$f":"INDEX(pml_matches!$C$2:$C$321,$A40)","v":""},""]
[9,{"$f":"INDEX(pml_matches!$C$2:$C$321,$A41)","v":""},""]
[10,{"$f":"INDEX(pml_matches!$C$2:$C$321,$A42)","v":""},""]
[11,{"$f":"INDEX(pml_matches!$C$2:$C$321,$A43)","v":""},""]
[12,{"$f":"INDEX(pml_matches!$C$2:$C$321,$A44)","v":""},""]
[13,{"$f":"INDEX(pml_matches!$C$2:$C$321,$A45)","v":""},""]
[14,{"$f":"INDEX(pml_matches!$C$2:$C$321,$A46)","v":""},""]
[15,{"$f":"INDEX(pml_matches!$C$2:$C$321,$A47)","v":""},""]
[16,{"$f":"INDEX(pml_matches!$C$2:$C$321,$A48)","v":""},""]
[17,{"$f":"INDEX(pml_matches!$C$2:$C$321,$A49)","v":""},""]
[18,{"$f":"INDEX(pml_matches!$C$2:$C$321,$A50)","v":""},""]
[19,{"$f":"INDEX(pml_matches!$C$2:$C$321,$A51)","v":""},""]
[20,{"$f":"INDEX(pml_matches!$C$2:$C$321,$A52)","v":""},""]
[21,{"$f":"INDEX(pml_matches!$C$2:$C$321,$A53)","v":""},""]
[22,{"$f":"INDEX(pml_matches!$C$2:$C$321,$A54)","v":""},""]
[23,{"$f":"INDEX(pml_matches!$C$2:$C$321,$A55)","v":""},""]
[24,{"$f":"INDEX(pml_matches!$C$2:$C$321,$A56)","v":""},""]
[25,{"$f":"INDEX(pml_matches!$C$2:$C$321,$A57)","v":""},""]
[26,{"$f":"INDEX(pml_matches!$C$2:$C$321,$A58)","v":""},""]
[27,{"$f":"INDEX(pml_matches!$C$2:$C$321,$A59)","v":""},""]
[28,{"$f":"INDEX(pml_matches!$C$2:$C$321,$A60)","v":""},""]
{"$rows_left_out":293}
{"sheet":"LEAGUES","index":3,"n_rows":44,"n_cols":4,"rows_kept":44,"cut":false,"hidden":false,"merged":[]}
[]
[null,"СЛУЖЕБЕН ИЗБОР НА ПОТОЦИ"]
[]
[null,"ДОМАКИН | ГОСТ   ",null,"НЕУТРАЛЕН ТЕРЕН"]
[]
[null,"ВАРИАНТ 1",null,"ВАРИАНТ 1"]
[1,{"$f":"INDEX(pml_leagues!$C$2:$C$25,$A7)","v":""},1,{"$f":"INDEX(pml_leagues!$C$2:$C$25,$C7)","v":""}]
[2,{"$f":"INDEX(pml_leagues!$C$2:$C$25,$A8)","v":""},3,{"$f":"INDEX(pml_leagues!$C$2:$C$25,$C8)","v":""}]
[3,{"$f":"INDEX(pml_leagues!$C$2:$C$25,$A9)","v":""},5,{"$f":"INDEX(pml_leagues!$C$2:$C$25,$C9)","v":""}]
[4,{"$f":"INDEX(pml_leagues!$C$2:$C$25,$A10)","v":""},7,{"$f":"INDEX(pml_leagues!$C$2:$C$25,$C10)","v":""}]
[5,{"$f":"INDEX(pml_leagues!$C$2:$C$25,$A11)","v":""},2,{"$f":"INDEX(pml_leagues!$C$2:$C$25,$C11)","v":""}]
[6,{"$f":"INDEX(pml_leagues!$C$2:$C$25,$A12)","v":""},4,{"$f":"INDEX(pml_leagues!$C$2:$C$25,$C12)","v":""}]
[7,{"$f":"INDEX(pml_leagues!$C$2:$C$25,$A13)","v":""},6,{"$f":"INDEX(pml_leagues!$C$2:$C$25,$C13)","v":""}]
[8,{"$f":"INDEX(pml_leagues!$C$2:$C$25,$A14)","v":""},8,{"$f":"INDEX(pml_leagues!$C$2:$C$25,$C14)","v":""}]
[]
[null,"ВАРИАНТ 2",null,"ВАРИАНТ 2"]
[1,{"$f":"INDEX(pml_leagues!$C$2:$C$25,$A17)","v":""},1,{"$f":"INDEX(pml_leagues!$C$2:$C$25,$C17)","v":""}]
[1,{"$f":"INDEX(pml_leagues!$C$2:$C$25,$A18)","v":""},1,{"$f":"INDEX(pml_leagues!$C$2:$C$25,$C18)","v":""}]
[2,{"$f":"INDEX(pml_leagues!$C$2:$C$25,$A19)","v":""},3,{"$f":"INDEX(pml_leagues!$C$2:$C$25,$C19)","v":""}]
[2,{"$f":"INDEX(pml_leagues!$C$2:$C$25,$A20)","v":""},3,{"$f":"INDEX(pml_leagues!$C$2:$C$25,$C20)","v":""}]
[3,{"$f":"INDEX(pml_leagues!$C$2:$C$25,$A21)","v":""},2,{"$f":"INDEX(pml_leagues!$C$2:$C$25,$C21)","v":""}]
[3,{"$f":"INDEX(pml_leagues!$C$2:$C$25,$A22)","v":""},2,{"$f":"INDEX(pml_leagues!$C$2:$C$25,$C22)","v":""}]
[4,{"$f":"INDEX(pml_leagues!$C$2:$C$25,$A23)","v":""},4,{"$f":"INDEX(pml_leagues!$C$2:$C$25,$C23)","v":""}]
[4,{"$f":"INDEX(pml_leagues!$C$2:$C$25,$A24)","v":""},4,{"$f":"INDEX(pml_leagues!$C$2:$C$25,$C24)","v":""}]
[]
[null,"ВАРИАНТ 3",null,"ВАРИАНТ 3"]
[1,{"$f":"INDEX(pml_leagues!$C$2:$C$25,$A27)","v":""},1,{"$f":"INDEX(pml_leagues!$C$2:$C$25,$C27)","v":""}]
[1,{"$f":"INDEX(pml_leagues!$C$2:$C$25,$A28)","v":""},1,{"$f":"INDEX(pml_leagues!$C$2:$C$25,$C28)","v":""}]
[2,{"$f":"INDEX(pml_leagues!$C$2:$C$25,$A29)","v":""},3,{"$f":"INDEX(pml_leagues!$C$2:$C$25,$C29)","v":""}]
[2,{"$f":"INDEX(pml_leagues!$C$2:$C$25,$A30)","v":""},5,{"$f":"INDEX(pml_leagues!$C$2:$C$25,$C30)","v":""}]
[3,{"$f":"INDEX(pml_leagues!$C$2:$C$25,$A31)","v":""},2,{"$f":"INDEX(pml_leagues!$C$2:$C$25,$C31)","v":""}]
[4,{"$f":"INDEX(pml_leagues!$C$2:$C$25,$A32)","v":""},2,{"$f":"INDEX(pml_leagues!$C$2:$C$25,$C32)","v":""}]
[5,{"$f":"INDEX(pml_leagues!$C$2:$C$25,$A33)","v":""},4,{"$f":"INDEX(pml_leagues!$C$2:$C$25,$C33)","v":""}]
[6,{"$f":"INDEX(pml_leagues!$C$2:$C$25,$A34)","v":""},6,{"$f":"INDEX(pml_leagues!$C$2:$C$25,$C34)","v":""}]
[]
[null,"ВАРИАНТ 4",null,"ВАРИАНТ 4"]
[1,{"$f":"INDEX(pml_leagues!$C$2:$C$25,$A37)","v":""},1,{"$f":"INDEX(pml_leagues!$C$2:$C$25,$C37)","v":""}]
[2,{"$f":"INDEX(pml_leagues!$C$2:$C$25,$A38)","v":""},3,{"$f":"INDEX(pml_leagues!$C$2:$C$25,$C38)","v":""}]
[3,{"$f":"INDEX(pml_leagues!$C$2:$C$25,$A39)","v":""},5,{"$f":"INDEX(pml_leagues!$C$2:$C$25,$C39)","v":""}]
[4,{"$f":"INDEX(pml_leagues!$C$2:$C$25,$A40)","v":""},5,{"$f":"INDEX(pml_leagues!$C$2:$C$25,$C40)","v":""}]
[5,{"$f":"INDEX(pml_leagues!$C$2:$C$25,$A41)","v":""},2,{"$f":"INDEX(pml_leagues!$C$2:$C$25,$C41)","v":""}]
[5,{"$f":"INDEX(pml_leagues!$C$2:$C$25,$A42)","v":""},4,{"$f":"INDEX(pml_leagues!$C$2:$C$25,$C42)","v":""}]
[6,{"$f":"INDEX(pml_leagues!$C$2:$C$25,$A43)","v":""},6,{"$f":"INDEX(pml_leagues!$C$2:$C$25,$C43)","v":""}]
[6,{"$f":"INDEX(pml_leagues!$C$2:$C$25,$A44)","v":""},6,{"$f":"INDEX(pml_leagues!$C$2:$C$25,$C44)","v":""}]

{"sheet":"MATCHES","index":4,"n_rows":40,"n_cols":8,"rows_kept":40,"cut":false,"hidden":false,"merged":[]}
[]
[null,"СЛУЖЕБЕН ИЗБОР НА МАЧОВЕ"]
[]
[null,"▼ ▼ ▼ попълни избраните потоци тук ▼ ▼ ▼",null,"ВАРИАНТ 1",null,"ВАРИАНТ 2",null,"ВАРИАНТ 3"]
[{"$f":"LEFT(B5,6)","v":""},null,{"$f":"VALUE(CONCATENATE(A5,0,1))","v":1},{"$f":"IFERROR(INDEX(DRAFTS!$B$33:$B$332,MATCH(C5,DRAFTS!$C$33:$C$332,0)),\"\")","v":""},{"$f":"VALUE(CONCATENATE(A5,0,1))","v":1},{"$f":"IFERROR(INDEX(DRAFTS!$B$33:$B$332,MATCH(E5,DRAFTS!$C$33:$C$332,0)),\"\")","v":""},{"$f":"VALUE(IF(OR(LEFT(A5,1)=\"2\",LEFT(A5,1)=\"3\"),CONCATENATE(A5,0,3),CONCATENATE(A5,0,5)))","v":5},{"$f":"IFERROR(INDEX(DRAFTS!$B$33:$B$332,MATCH(G5,DRAFTS!$C$33:$C$332,0)),\"\")","v":""}]
[{"$f":"LEFT(B6,6)","v":""},null,{"$f":"VALUE(IF(A6=A5,CONCATENATE(A6,0,3),CONCATENATE(A6,0,1)))","v":3},{"$f":"IFERROR(INDEX(DRAFTS!$B$33:$B$332,MATCH(C6,DRAFTS!$C$33:$C$332,0)),\"\")","v":""},{"$f":"VALUE(IF(A6=A5,CONCATENATE(A6,0,2),CONCATENATE(A6,0,1)))","v":2},{"$f":"IFERROR(INDEX(DRAFTS!$B$33:$B$332,MATCH(E6,DRAFTS!$C$33:$C$332,0)),\"\")","v":""},{"$f":"VALUE(IF(OR(LEFT(A6,1)=\"2\",LEFT(A6,1)=\"3\"),CONCATENATE(A6,0,3),IF(A6=A5,CONCATENATE(A6,0,7),CONCATENATE(A6,0,5))))","v":7},{"$f":"IFERROR(INDEX(DRAFTS!$B$33:$B$332,MATCH(G6,DRAFTS!$C$33:$C$332,0)),\"\")","v":""}]
["",null,{"$f":"VALUE(IF(OR(A7=A6,A7=A5),CONCATENATE(A7,0,3),CONCATENATE(A7,0,1)))","v":3},{"$f":"IFERROR(INDEX(DRAFTS!$B$33:$B$332,MATCH(C7,DRAFTS!$C$33:$C$332,0)),\"\")","v":""},{"$f":"VALUE(IF(OR(A7=A6,A7=A5),CONCATENATE(A7,0,2),CONCATENATE(A7,0,1)))","v":2},{"$f":"IFERROR(INDEX(DRAFTS!$B$33:$B$332,MATCH(E7,DRAFTS!$C$33:$C$332,0)),\"\")","v":""},{"$f":"VALUE(IF(OR(LEFT(A7,1)=\"2\",LEFT(A7,1)=\"3\"),CONCATENATE(A7,0,3),IF(OR(A7=A6,A7=A5),CONCATENATE(A7,0,7),CONCATENATE(A7,0,5))))","v":7},{"$f":"IFERROR(INDEX(DRAFTS!$B$33:$B$332,MATCH(G7,DRAFTS!$C$33:$C$332,0)),\"\")","v":""}]
["",null,{"$f":"VALUE(IF(OR(A8=A7,A8=A6,A8=A5),CONCATENATE(A8,0,3),CONCATENATE(A8,0,1)))","v":3},{"$f":"IFERROR(INDEX(DRAFTS!$B$33:$B$332,MATCH(C8,DRAFTS!$C$33:$C$332,0)),\"\")","v":""},{"$f":"VALUE(IF(OR(A8=A7,A8=A6,A8=A5),CONCATENATE(A8,0,2),CONCATENATE(A8,0,1)))","v":2},{"$f":"IFERROR(INDEX(DRAFTS!$B$33:$B$332,MATCH(E8,DRAFTS!$C$33:$C$332,0)),\"\")","v":""},{"$f":"VALUE(IF(OR(LEFT(A8,1)=\"2\",LEFT(A8,1)=\"3\"),CONCATENATE(A8,0,3),IF(OR(A8=A7,A8=A6,A8=A5),CONCATENATE(A8,0,7),CONCATENATE(A8,0,5))))","v":7},{"$f":"IFERROR(INDEX(DRAFTS!$B$33:$B$332,MATCH(G8,DRAFTS!$C$33:$C$332,0)),\"\")","v":""}]
["",null,{"$f":"VALUE(IF(OR(A9=A8,A9=A7,A9=A6,A9=A5),CONCATENATE(A9,0,3),CONCATENATE(A9,0,1)))","v":3},{"$f":"IFERROR(INDEX(DRAFTS!$B$33:$B$332,MATCH(C9,DRAFTS!$C$33:$C$332,0)),\"\")","v":""},{"$f":"VALUE(IF(OR(A9=A8,A9=A7,A9=A6,A9=A5),CONCATENATE(A9,0,2),CONCATENATE(A9,0,1)))","v":2},{"$f":"IFERROR(INDEX(DRAFTS!$B$33:$B$332,MATCH(E9,DRAFTS!$C$33:$C$332,0)),\"\")","v":""},{"$f":"VALUE(IF(OR(LEFT(A9,1)=\"2\",LEFT(A9,1)=\"3\"),CONCATENATE(A9,0,3),IF(OR(A9=A8,A9=A7,A9=A6,A9=A5),CONCATENATE(A9,0,7),CONCATENATE(A9,0,5))))","v":7},{"$f":"IFERROR(INDEX(DRAFTS!$B$33:$B$332,MATCH(G9,DRAFTS!$C$33:$C$332,0)),\"\")","v":""}]
["",null,{"$f":"VALUE(IF(OR(A10=A9,A10=A8,A10=A7,A10=A6,A10=A5),CONCATENATE(A10,0,3),CONCATENATE(A10,0,1)))","v":3},{"$f":"IFERROR(INDEX(DRAFTS!$B$33:$B$332,MATCH(C10,DRAFTS!$C$33:$C$332,0)),\"\")","v":""},{"$f":"VALUE(IF(OR(A10=A9,A10=A8,A10=A7,A10=A6,A10=A5),CONCATENATE(A10,0,2),CONCATENATE(A10,0,1)))","v":2},{"$f":"IFERROR(INDEX(DRAFTS!$B$33:$B$332,MATCH(E10,DRAFTS!$C$33:$C$332,0)),\"\")","v":""},{"$f":"VALUE(IF(OR(LEFT(A10,1)=\"2\",LEFT(A10,1)=\"3\"),CONCATENATE(A10,0,3),IF(OR(A10=A9,A10=A8,A10=A7,A10=A6,A10=A5),CONCATENATE(A10,0,7),CONCATENATE(A10,0,5))))","v":7},{"$f":"IFERROR(INDEX(DRAFTS!$B$33:$B$332,MATCH(G10,DRAFTS!$C$33:$C$332,0)),\"\")","v":""}]
["",null,{"$f":"VALUE(IF(OR(A11=A10,A11=A9,A11=A8,A11=A7,A11=A6,A11=A5),CONCATENATE(A11,0,3),CONCATENATE(A11,0,1)))","v":3},{"$f":"IFERROR(INDEX(DRAFTS!$B$33:$B$332,MATCH(C11,DRAFTS!$C$33:$C$332,0)),\"\")","v":""},{"$f":"VALUE(IF(OR(A11=A10,A11=A9,A11=A8,A11=A7,A11=A6,A11=A5),CONCATENATE(A11,0,2),CONCATENATE(A11,0,1)))","v":2},{"$f":"IFERROR(INDEX(DRAFTS!$B$33:$B$332,MATCH(E11,DRAFTS!$C$33:$C$332,0)),\"\")","v":""},{"$f":"VALUE(IF(OR(LEFT(A11,1)=\"2\",LEFT(A11,1)=\"3\"),CONCATENATE(A11,0,3),IF(OR(A11=A10,A11=A9,A11=A8,A11=A7,A11=A6,A11=A5),CONCATENATE(A11,0,7),CONCATENATE(A11,0,5))))","v":7},{"$f":"IFERROR(INDEX(DRAFTS!$B$33:$B$332,MATCH(G11,DRAFTS!$C$33:$C$332,0)),\"\")","v":""}]
["",null,{"$f":"VALUE(IF(OR(A12=A11,A12=A10,A12=A9,A12=A8,A12=A7,A12=A6,A12=A5),CONCATENATE(A12,0,3),CONCATENATE(A12,0,1)))","v":3},{"$f":"IFERROR(INDEX(DRAFTS!$B$33:$B$332,MATCH(C12,DRAFTS!$C$33:$C$332,0)),\"\")","v":""},{"$f":"VALUE(IF(OR(A12=A11,A12=A10,A12=A9,A12=A8,A12=A7,A12=A6,A12=A5),CONCATENATE(A12,0,2),CONCATENATE(A12,0,1)))","v":2},{"$f":"IFERROR(INDEX(DRAFTS!$B$33:$B$332,MATCH(E12,DRAFTS!$C$33:$C$332,0)),\"\")","v":""},{"$f":"VALUE(IF(OR(LEFT(A12,1)=\"2\",LEFT(A12,1)=\"3\"),CONCATENATE(A12,0,3),IF(OR(A12=A11,A12=A10,A12=A9,A12=A8,A12=A7,A12=A6,A12=A5),CONCATENATE(A12,0,7),CONCATENATE(A12,0,5))))","v":7},{"$f":"IFERROR(INDEX(DRAFTS!$B$33:$B$332,MATCH(G12,DRAFTS!$C$33:$C$332,0)),\"\")","v":""}]
[null,null,null,"<>",null,"<>",null,"<>"]
[null,null,{"$f":"VALUE(CONCATENATE(A5,0,2))","v":2},{"$f":"IFERROR(INDEX(DRAFTS!$B$33:$B$332,MATCH(C14,DRAFTS!$C$33:$C$332,0)),\"\")","v":""},{"$f":"VALUE(IF(OR(LEFT(A5,1)=\"2\",LEFT(A5,1)=\"3\"),CONCATENATE(A5,0,4),CONCATENATE(A5,0,8)))","v":8},{"$f":"IFERROR(INDEX(DRAFTS!$B$33:$B$332,MATCH(E14,DRAFTS!$C$33:$C$332,0)),\"\")","v":""},{"$f":"VALUE(IF(OR(LEFT(A5,1)=\"2\",LEFT(A5,1)=\"3\"),CONCATENATE(A5,0,4),CONCATENATE(A5,0,6)))","v":6},{"$f":"IFERROR(INDEX(DRAFTS!$B$33:$B$332,MATCH(G14,DRAFTS!$C$33:$C$332,0)),\"\")","v":""}]
[null,null,{"$f":"VALUE(IF(A6=A5,CONCATENATE(A6,0,4),CONCATENATE(A6,0,2)))","v":4},{"$f":"IFERROR(INDEX(DRAFTS!$B$33:$B$332,MATCH(C15,DRAFTS!$C$33:$C$332,0)),\"\")","v":""},{"$f":"VALUE(IF(OR(LEFT(A6,1)=\"2\",LEFT(A6,1)=\"3\"),CONCATENATE(A6,0,4),IF(A6=A5,CONCATENATE(A6,0,7),CONCATENATE(A6,0,8))))","v":7},{"$f":"IFERROR(INDEX(DRAFTS!$B$33:$B$332,MATCH(E15,DRAFTS!$C$33:$C$332,0)),\"\")","v":""},{"$f":"VALUE(IF(OR(LEFT(A6,1)=\"2\",LEFT(A6,1)=\"3\"),CONCATENATE(A6,0,4),IF(A6=A5,CONCATENATE(A6,0,8),CONCATENATE(A6,0,6))))","v":8},{"$f":"IFERROR(INDEX(DRAFTS!$B$33:$B$332,MATCH(G15,DRAFTS!$C$33:$C$332,0)),\"\")","v":""}]
[null,null,{"$f":"VALUE(IF(OR(A7=A6,A7=A5),CONCATENATE(A7,0,4),CONCATENATE(A7,0,2)))","v":4},{"$f":"IFERROR(INDEX(DRAFTS!$B$33:$B$332,MATCH(C16,DRAFTS!$C$33:$C$332,0)),\"\")","v":""},{"$f":"VALUE(IF(OR(LEFT(A7,1)=\"2\",LEFT(A7,1)=\"3\"),CONCATENATE(A7,0,4),IF(OR(A7=A6,A7=A5),CONCATENATE(A7,0,7),CONCATENATE(A7,0,8))))","v":7},{"$f":"IFERROR(INDEX(DRAFTS!$B$33:$B$332,MATCH(E16,DRAFTS!$C$33:$C$332,0)),\"\")","v":""},{"$f":"VALUE(IF(OR(LEFT(A7,1)=\"2\",LEFT(A7,1)=\"3\"),CONCATENATE(A7,0,4),IF(OR(A7=A6,A7=A5),CONCATENATE(A7,0,8),CONCATENATE(A7,0,6))))","v":8},{"$f":"IFERROR(INDEX(DRAFTS!$B$33:$B$332,MATCH(G16,DRAFTS!$C$33:$C$332,0)),\"\")","v":""}]
[1,{"$f":"INDEX(DRAFTS!$B$4:$B$27,$A17)","v":""},{"$f":"VALUE(IF(OR(A8=A7,A8=A6,A8=A5),CONCATENATE(A8,0,4),CONCATENATE(A8,0,2)))","v":4},{"$f":"IFERROR(INDEX(DRAFTS!$B$33:$B$332,MATCH(C17,DRAFTS!$C$33:$C$332,0)),\"\")","v":""},{"$f":"VALUE(IF(OR(LEFT(A8,1)=\"2\",LEFT(A8,1)=\"3\"),CONCATENATE(A8,0,4),IF(OR(A8=A7,A8=A6,A8=A5),CONCATENATE(A8,0,7),CONCATENATE(A8,0,8))))","v":7},{"$f":"IFERROR(INDEX(DRAFTS!$B$33:$B$332,MATCH(E17,DRAFTS!$C$33:$C$332,0)),\"\")","v":""},{"$f":"VALUE(IF(OR(LEFT(A8,1)=\"2\",LEFT(A8,1)=\"3\"),CONCATENATE(A8,0,4),IF(OR(A8=A7,A8=A6,A8=A5),CONCATENATE(A8,0,8),CONCATENATE(A8,0,6))))","v":8},{"$f":"IFERROR(INDEX(DRAFTS!$B$33:$B$332,MATCH(G17,DRAFTS!$C$33:$C$332,0)),\"\")","v":""}]
[2,{"$f":"INDEX(DRAFTS!$B$4:$B$27,$A18)","v":""},{"$f":"VALUE(IF(OR(A9=A8,A9=A7,A9=A6,A9=A5),CONCATENATE(A9,0,4),CONCATENATE(A9,0,2)))","v":4},{"$f":"IFERROR(INDEX(DRAFTS!$B$33:$B$332,MATCH(C18,DRAFTS!$C$33:$C$332,0)),\"\")","v":""},{"$f":"VALUE(IF(OR(LEFT(A9,1)=\"2\",LEFT(A9,1)=\"3\"),CONCATENATE(A9,0,4),IF(OR(A9=A8,A9=A7,A9=A6,A9=A5),CONCATENATE(A9,0,7),CONCATENATE(A9,0,8))))","v":7},{"$f":"IFERROR(INDEX(DRAFTS!$B$33:$B$332,MATCH(E18,DRAFTS!$C$33:$C$332,0)),\"\")","v":""},{"$f":"VALUE(IF(OR(LEFT(A9,1)=\"2\",LEFT(A9,1)=\"3\"),CONCATENATE(A9,0,4),IF(OR(A9=A8,A9=A7,A9=A6,A9=A5),CONCATENATE(A9,0,8),CONCATENATE(A9,0,6))))","v":8},{"$f":"IFERROR(INDEX(DRAFTS!$B$33:$B$332,MATCH(G18,DRAFTS!$C$33:$C$332,0)),\"\")","v":""}]
[3,{"$f":"INDEX(DRAFTS!$B$4:$B$27,$A19)","v":""},{"$f":"VALUE(IF(OR(A10=A9,A10=A8,A10=A7,A10=A6,A10=A5),CONCATENATE(A10,0,4),CONCATENATE(A10,0,2)))","v":4},{"$f":"IFERROR(INDEX(DRAFTS!$B$33:$B$332,MATCH(C19,DRAFTS!$C$33:$C$332,0)),\"\")","v":""},{"$f":"VALUE(IF(OR(LEFT(A10,1)=\"2\",LEFT(A10,1)=\"3\"),CONCATENATE(A10,0,4),IF(OR(A10=A9,A10=A8,A10=A7,A10=A6,A10=A5),CONCATENATE(A10,0,7),CONCATENATE(A10,0,8))))","v":7},{"$f":"IFERROR(INDEX(DRAFTS!$B$33:$B$332,MATCH(E19,DRAFTS!$C$33:$C$332,0)),\"\")","v":""},{"$f":"VALUE(IF(OR(LEFT(A10,1)=\"2\",LEFT(A10,1)=\"3\"),CONCATENATE(A10,0,4),IF(OR(A10=A9,A10=A8,A10=A7,A10=A6,A10=A5),CONCATENATE(A10,0,8),CONCATENATE(A10,0,6))))","v":8},{"$f":"IFERROR(INDEX(DRAFTS!$B$33:$B$332,MATCH(G19,DRAFTS!$C$33:$C$332,0)),\"\")","v":""}]
[4,{"$f":"INDEX(DRAFTS!$B$4:$B$27,$A20)","v":""},{"$f":"VALUE(IF(OR(A11=A10,A11=A9,A11=A8,A11=A7,A11=A6,A11=A5),CONCATENATE(A11,0,4),CONCATENATE(A11,0,2)))","v":4},{"$f":"IFERROR(INDEX(DRAFTS!$B$33:$B$332,MATCH(C20,DRAFTS!$C$33:$C$332,0)),\"\")","v":""},{"$f":"VALUE(IF(OR(LEFT(A11,1)=\"2\",LEFT(A11,1)=\"3\"),CONCATENATE(A11,0,4),IF(OR(A11=A10,A11=A9,A11=A8,A11=A7,A11=A6,A11=A5),CONCATENATE(A11,0,7),CONCATENATE(A11,0,8))))","v":7},{"$f":"IFERROR(INDEX(DRAFTS!$B$33:$B$332,MATCH(E20,DRAFTS!$C$33:$C$332,0)),\"\")","v":""},{"$f":"VALUE(IF(OR(LEFT(A11,1)=\"2\",LEFT(A11,1)=\"3\"),CONCATENATE(A11,0,4),IF(OR(A11=A10,A11=A9,A11=A8,A11=A7,A11=A6,A11=A5),CONCATENATE(A11,0,8),CONCATENATE(A11,0,6))))","v":8},{"$f":"IFERROR(INDEX(DRAFTS!$B$33:$B$332,MATCH(G20,DRAFTS!$C$33:$C$332,0)),\"\")","v":""}]
[5,{"$f":"INDEX(DRAFTS!$B$4:$B$27,$A21)","v":""},{"$f":"VALUE(IF(OR(A12=A11,A12=A10,A12=A9,A12=A8,A12=A7,A12=A6,A12=A5),CONCATENATE(A12,0,4),CONCATENATE(A12,0,2)))","v":4},{"$f":"IFERROR(INDEX(DRAFTS!$B$33:$B$332,MATCH(C21,DRAFTS!$C$33:$C$332,0)),\"\")","v":""},{"$f":"VALUE(IF(OR(LEFT(A12,1)=\"2\",LEFT(A12,1)=\"3\"),CONCATENATE(A12,0,4),IF(OR(A12=A11,A12=A10,A12=A9,A12=A8,A12=A7,A12=A6,A12=A5),CONCATENATE(A12,0,7),CONCATENATE(A12,0,8))))","v":7},{"$f":"IFERROR(INDEX(DRAFTS!$B$33:$B$332,MATCH(E21,DRAFTS!$C$33:$C$332,0)),\"\")","v":""},{"$f":"VALUE(IF(OR(LEFT(A12,1)=\"2\",LEFT(A12,1)=\"3\"),CONCATENATE(A12,0,4),IF(OR(A12=A11,A12=A10,A12=A9,A12=A8,A12=A7,A12=A6,A12=A5),CONCATENATE(A12,0,8),CONCATENATE(A12,0,6))))","v":8},{"$f":"IFERROR(INDEX(DRAFTS!$B$33:$B$332,MATCH(G21,DRAFTS!$C$33:$C$332,0)),\"\")","v":""}]
[6,{"$f":"INDEX(DRAFTS!$B$4:$B$27,$A22)","v":""}]
[7,{"$f":"INDEX(DRAFTS!$B$4:$B$27,$A23)","v":""},null,"ВАРИАНТ 4",null,"ВАРИАНТ 5",null,"ВАРИАНТ 6"]
[8,{"$f":"INDEX(DRAFTS!$B$4:$B$27,$A24)","v":""},{"$f":"C14","v":2},{"$f":"IFERROR(INDEX(DRAFTS!$B$33:$B$332,MATCH(C24,DRAFTS!$C$33:$C$332,0)),\"\")","v":""},{"$f":"E14","v":8},{"$f":"IFERROR(INDEX(DRAFTS!$B$33:$B$332,MATCH(E24,DRAFTS!$C$33:$C$332,0)),\"\")","v":""},{"$f":"G14","v":6},{"$f":"IFERROR(INDEX(DRAFTS!$B$33:$B$332,MATCH(G24,DRAFTS!$C$33:$C$332,0)),\"\")","v":""}]
[9,{"$f":"INDEX(DRAFTS!$B$4:$B$27,$A25)","v":""},4,{"$f":"IFERROR(INDEX(DRAFTS!$B$33:$B$332,MATCH(C25,DRAFTS!$C$33:$C$332,0)),\"\")","v":""},7,{"$f":"IFERROR(INDEX(DRAFTS!$B$33:$B$332,MATCH(E25,DRAFTS!$C$33:$C$332,0)),\"\")","v":""},8,{"$f":"IFERROR(INDEX(DRAFTS!$B$33:$B$332,MATCH(G25,DRAFTS!$C$33:$C$332,0)),\"\")","v":""}]
[10,{"$f":"INDEX(DRAFTS!$B$4:$B$27,$A26)","v":""},4,{"$f":"IFERROR(INDEX(DRAFTS!$B$33:$B$332,MATCH(C26,DRAFTS!$C$33:$C$332,0)),\"\")","v":""},7,{"$f":"IFERROR(INDEX(DRAFTS!$B$33:$B$332,MATCH(E26,DRAFTS!$C$33:$C$332,0)),\"\")","v":""},8,{"$f":"IFERROR(INDEX(DRAFTS!$B$33:$B$332,MATCH(G26,DRAFTS!$C$33:$C$332,0)),\"\")","v":""}]
[11,{"$f":"INDEX(DRAFTS!$B$4:$B$27,$A27)","v":""},4,{"$f":"IFERROR(INDEX(DRAFTS!$B$33:$B$332,MATCH(C27,DRAFTS!$C$33:$C$332,0)),\"\")","v":""},7,{"$f":"IFERROR(INDEX(DRAFTS!$B$33:$B$332,MATCH(E27,DRAFTS!$C$33:$C$332,0)),\"\")","v":""},8,{"$f":"IFERROR(INDEX(DRAFTS!$B$33:$B$332,MATCH(G27,DRAFTS!$C$33:$C$332,0)),\"\")","v":""}]
[12,{"$f":"INDEX(DRAFTS!$B$4:$B$27,$A28)","v":""},4,{"$f":"IFERROR(INDEX(DRAFTS!$B$33:$B$332,MATCH(C28,DRAFTS!$C$33:$C$332,0)),\"\")","v":""},7,{"$f":"IFERROR(INDEX(DRAFTS!$B$33:$B$332,MATCH(E28,DRAFTS!$C$33:$C$332,0)),\"\")","v":""},8,{"$f":"IFERROR(INDEX(DRAFTS!$B$33:$B$332,MATCH(G28,DRAFTS!$C$33:$C$332,0)),\"\")","v":""}]
[13,{"$f":"INDEX(DRAFTS!$B$4:$B$27,$A29)","v":""},4,{"$f":"IFERROR(INDEX(DRAFTS!$B$33:$B$332,MATCH(C29,DRAFTS!$C$33:$C$332,0)),\"\")","v":""},7,{"$f":"IFERROR(INDEX(DRAFTS!$B$33:$B$332,MATCH(E29,DRAFTS!$C$33:$C$332,0)),\"\")","v":""},8,{"$f":"IFERROR(INDEX(DRAFTS!$B$33:$B$332,MATCH(G29,DRAFTS!$C$33:$C$332,0)),\"\")","v":""}]
[14,{"$f":"INDEX(DRAFTS!$B$4:$B$27,$A30)","v":""},4,{"$f":"IFERROR(INDEX(DRAFTS!$B$33:$B$332,MATCH(C30,DRAFTS!$C$33:$C$332,0)),\"\")","v":""},7,{"$f":"IFERROR(INDEX(DRAFTS!$B$33:$B$332,MATCH(E30,DRAFTS!$C$33:$C$332,0)),\"\")","v":""},8,{"$f":"IFERROR(INDEX(DRAFTS!$B$33:$B$332,MATCH(G30,DRAFTS!$C$33:$C$332,0)),\"\")","v":""}]
[15,{"$f":"INDEX(DRAFTS!$B$4:$B$27,$A31)","v":""},4,{"$f":"IFERROR(INDEX(DRAFTS!$B$33:$B$332,MATCH(C31,DRAFTS!$C$33:$C$332,0)),\"\")","v":""},7,{"$f":"IFERROR(INDEX(DRAFTS!$B$33:$B$332,MATCH(E31,DRAFTS!$C$33:$C$332,0)),\"\")","v":""},8,{"$f":"IFERROR(INDEX(DRAFTS!$B$33:$B$332,MATCH(G31,DRAFTS!$C$33:$C$332,0)),\"\")","v":""}]
[16,{"$f":"INDEX(DRAFTS!$B$4:$B$27,$A32)","v":""},null,"<>",null,"<>",null,"<>"]
[17,{"$f":"INDEX(DRAFTS!$B$4:$B$27,$A33)","v":""},{"$f":"C5","v":1},{"$f":"IFERROR(INDEX(DRAFTS!$B$33:$B$332,MATCH(C33,DRAFTS!$C$33:$C$332,0)),\"\")","v":""},{"$f":"E5","v":1},{"$f":"IFERROR(INDEX(DRAFTS!$B$33:$B$332,MATCH(E33,DRAFTS!$C$33:$C$332,0)),\"\")","v":""},{"$f":"G5","v":5},{"$f":"IFERROR(INDEX(DRAFTS!$B$33:$B$332,MATCH(G33,DRAFTS!$C$33:$C$332,0)),\"\")","v":""}]
[18,{"$f":"INDEX(DRAFTS!$B$4:$B$27,$A34)","v":""},3,{"$f":"IFERROR(INDEX(DRAFTS!$B$33:$B$332,MATCH(C34,DRAFTS!$C$33:$C$332,0)),\"\")","v":""},2,{"$f":"IFERROR(INDEX(DRAFTS!$B$33:$B$332,MATCH(E34,DRAFTS!$C$33:$C$332,0)),\"\")","v":""},7,{"$f":"IFERROR(INDEX(DRAFTS!$B$33:$B$332,MATCH(G34,DRAFTS!$C$33:$C$332,0)),\"\")","v":""}]
[19,{"$f":"INDEX(DRAFTS!$B$4:$B$27,$A35)","v":""},3,{"$f":"IFERROR(INDEX(DRAFTS!$B$33:$B$332,MATCH(C35,DRAFTS!$C$33:$C$332,0)),\"\")","v":""},2,{"$f":"IFERROR(INDEX(DRAFTS!$B$33:$B$332,MATCH(E35,DRAFTS!$C$33:$C$332,0)),\"\")","v":""},7,{"$f":"IFERROR(INDEX(DRAFTS!$B$33:$B$332,MATCH(G35,DRAFTS!$C$33:$C$332,0)),\"\")","v":""}]
[20,{"$f":"INDEX(DRAFTS!$B$4:$B$27,$A36)","v":""},3,{"$f":"IFERROR(INDEX(DRAFTS!$B$33:$B$332,MATCH(C36,DRAFTS!$C$33:$C$332,0)),\"\")","v":""},2,{"$f":"IFERROR(INDEX(DRAFTS!$B$33:$B$332,MATCH(E36,DRAFTS!$C$33:$C$332,0)),\"\")","v":""},7,{"$f":"IFERROR(INDEX(DRAFTS!$B$33:$B$332,MATCH(G36,DRAFTS!$C$33:$C$332,0)),\"\")","v":""}]
[21,{"$f":"INDEX(DRAFTS!$B$4:$B$27,$A37)","v":""},3,{"$f":"IFERROR(INDEX(DRAFTS!$B$33:$B$332,MATCH(C37,DRAFTS!$C$33:$C$332,0)),\"\")","v":""},2,{"$f":"IFERROR(INDEX(DRAFTS!$B$33:$B$332,MATCH(E37,DRAFTS!$C$33:$C$332,0)),\"\")","v":""},7,{"$f":"IFERROR(INDEX(DRAFTS!$B$33:$B$332,MATCH(G37,DRAFTS!$C$33:$C$332,0)),\"\")","v":""}]
[22,{"$f":"INDEX(DRAFTS!$B$4:$B$27,$A38)","v":""},3,{"$f":"IFERROR(INDEX(DRAFTS!$B$33:$B$332,MATCH(C38,DRAFTS!$C$33:$C$332,0)),\"\")","v":""},2,{"$f":"IFERROR(INDEX(DRAFTS!$B$33:$B$332,MATCH(E38,DRAFTS!$C$33:$C$332,0)),\"\")","v":""},7,{"$f":"IFERROR(INDEX(DRAFTS!$B$33:$B$332,MATCH(G38,DRAFTS!$C$33:$C$332,0)),\"\")","v":""}]
[23,{"$f":"INDEX(DRAFTS!$B$4:$B$27,$A39)","v":""},3,{"$f":"IFERROR(INDEX(DRAFTS!$B$33:$B$332,MATCH(C39,DRAFTS!$C$33:$C$332,0)),\"\")","v":""},2,{"$f":"IFERROR(INDEX(DRAFTS!$B$33:$B$332,MATCH(E39,DRAFTS!$C$33:$C$332,0)),\"\")","v":""},7,{"$f":"IFERROR(INDEX(DRAFTS!$B$33:$B$332,MATCH(G39,DRAFTS!$C$33:$C$332,0)),\"\")","v":""}]
[24,{"$f":"INDEX(DRAFTS!$B$4:$B$27,$A40)","v":""},3,{"$f":"IFERROR(INDEX(DRAFTS!$B$33:$B$332,MATCH(C40,DRAFTS!$C$33:$C$332,0)),\"\")","v":""},2,{"$f":"IFERROR(INDEX(DRAFTS!$B$33:$B$332,MATCH(E40,DRAFTS!$C$33:$C$332,0)),\"\")","v":""},7,{"$f":"IFERROR(INDEX(DRAFTS!$B$33:$B$332,MATCH(G40,DRAFTS!$C$33:$C$332,0)),\"\")","v":""}]